Artwork by technique
preferred label: Kunstwerk nach Technik @de

Wood engraving
type: Concept
in scheme: scheme
preferred label: Holzstich @de
alternative label: Gravure sur bois @fr
alternative label: Incisione su legno @it
broader: Artwork by technique
scope note: Ein Werk (Holzstich), das im Hochdruckverfahren gedruckt wurde. Die Technik wurde gegen Ende des 18. Jahrhunderts aus dem Holzschnitt entwickelt. @de
change note:
  creator: Sophie Guermann
  modified: 2021-09-14T08:01:19+00:00
change note:
  comment: initial version
  created: 2021-06-02T09:38:23+00:00
  creator: Sophie Guermann
change note:
  creator: Michael Matile
  modified: 2021-10-19T07:42:48+00:00