Artists by activity, medium or work type
preferred label: Künstler nach Tätigkeit, Medium oder Werkart @de

Printmaker
preferred label: Druckgrafiker @de

Wood engraver
type: Concept
in scheme: scheme
preferred label: Holzstecher @de
alternative label: wood engraver
alternative label: xylographe @fr
alternative label: xilografo @it
broader: Artists by activity, medium or work type
related: Printmaker
change note:
  creator: Michael Matile
  modified: 2021-10-30T12:00:41+00:00
change note:
  creator: Michael Matile
  modified: 2021-10-19T08:31:45+00:00
change note:
  creator: Sophie Guermann
  modified: 2021-05-19T06:06:01+00:00
change note:
  comment: initial version
  created: 2021-05-12T07:39:14+00:00
  creator: Sophie Guermann
change note:
  creator: Sophie Guermann
  modified: 2021-05-25T14:52:20+00:00
change note:
  creator: Sophie Guermann
  modified: 2021-06-01T13:46:30+00:00
change note:
  creator: Sophie Guermann
  modified: 2021-06-01T13:48:39+00:00
change note:
  creator: Sophie Guermann
  modified: 2021-09-13T14:19:32+00:00
change note:
  creator: Sophie Guermann
  modified: 2021-09-16T08:11:47+00:00
scope note: Bezeichnet die Person, die mit dem Stichel in Holz sticht. @de
change note:
  creator: Florian Kräutli
  modified: 2022-03-25T11:59:52+00:00
related match: E12 Production