People by activity, in commerce and business
preferred label: Personen nach Tätigkeit, in Handel und Gewerbe @de

Publisher
preferred label: Verleger @de

Coordinator
type: Concept
in scheme: scheme
preferred label: Koordinator @de
alternative label: direct.
alternative label: director
alternative label: unt. Leit. v. @de
alternative label: Coordinateur @fr
alternative label: publiee @fr
alternative label: sous la direction de @fr
alternative label: coordinatore di produzione @it
alternative label: direx. @la
alternative label: dierexit @la
alternative label: direxit @la
alternative label: iussit @la
broader: People by activity, in commerce and business
related: Publisher
change note:
  creator: Sophie Guermann
  modified: 2021-09-14T15:00:49+00:00
change note:
  creator: Sophie Guermann
  modified: 2021-09-14T07:07:51+00:00
change note:
  creator: Sophie Guermann
  modified: 2021-06-01T12:14:35+00:00
change note:
  comment: initial version
  created: 2021-06-01T08:20:27+00:00
  creator: Sophie Guermann
change note:
  creator: Michael Matile
  modified: 2022-01-24T15:53:51+00:00
scope note: Bezeichnet die Person, welche ein Druckprojekt leitet und die daran beteiligten Personen (Zeichner, Stecher, Drucker etc.) koordiniert. @de
change note:
  creator: Florian Kräutli
  modified: 2022-08-24T14:25:38+00:00
related match: E12 Production