Druckgrafik machen
preferred label: printmaking @en

Schabkünstler
preferred label: Mezzotinter @en

Schabkunstmanier
type: Concept
in scheme: scheme
preferred label: mezzotint engraving @en
alternative label: graver en technique mezzotint @fr
alternative label: Intagliare in tecnica mezzotinta @it
broader: Druckgrafik machen
related: Schabkünstler
change note:
  creator: Michael Matile
  modified: 2022-01-24T13:30:05+00:00
change note:
  comment: Initiale Version
  created: 2021-10-31T12:02:32+00:00
  creator: Michael Matile
change note:
  creator: Michael Matile
  modified: 2022-01-24T10:42:17+00:00
scope note: Bezeichnet die Technik, mit der man eine Kupferplatte mittels eines Schabmessers aufrauht und damit im Druck Flächentöne erzielen kann. Die Technik wurde u. a. als druckgraphisches Äquivalent für Ölmalerei verwendet (Gemäldereproduktion).
change note:
  creator: Michael Matile
  modified: 2022-01-24T13:51:01+00:00