People by activity, in commerce and business
preferred label: Personen nach Tätigkeit, in Handel und Gewerbe @de

Book dealer
type: Concept
in scheme: scheme
preferred label: Buchhändler @de
alternative label: Bookseller
alternative label: Buchhandlung @de
alternative label: Marchand de livres @fr
alternative label: Libraire @fr
alternative label: librairie @fr
alternative label: Libraio @it
broader: People by activity, in commerce and business
change note:
  creator: Sophie Guermann
  modified: 2021-09-14T07:06:54+00:00
change note:
  creator: Sophie Guermann
  modified: 2021-05-19T08:39:41+00:00
change note:
  creator: Sophie Guermann
  modified: 2021-05-19T08:25:17+00:00
change note:
  creator: Michael Matile
  modified: 2021-05-17T06:14:33+00:00
change note:
  comment: initial version
  created: 2021-05-12T08:22:21+00:00
  creator: Sophie Guermann
change note:
  creator: Sophie Guermann
  modified: 2021-05-18T09:16:39+00:00
change note:
  creator: Sophie Guermann
  modified: 2021-05-19T08:38:10+00:00
change note:
  creator: Michael Matile
  modified: 2022-01-24T15:49:05+00:00
scope note: Bezeichnet denjenigen, der Bücher - evtl. auch in Kombination mit Druckgraphik (illustrierte Bücher) - verkauft. @de
change note:
  creator: Florian Kräutli
  modified: 2022-02-14T14:43:29+00:00
related match: E12 Production