Weichgrundradierer
preferred label: Soft-ground etcher @en

Radierung
preferred label: Etching @en

Weichgrundradierung
type: Concept
in scheme: scheme
preferred label: Soft-ground etching @en
alternative label: Durchdruckverfahren
alternative label: Vernis mou @fr
alternative label: Gravure en vernis mou @fr
alternative label: Vernice molle @it
related: Weichgrundradierer
broader: Radierung
change note:
  comment: initial version @en
  created: 2022-02-01T14:20:23+00:00
  creator: Michael Matile
scope note: Spezielles Radierverfahren, bei dem mit einem weichen Radiergrund gearbeit wird. Verwendet man ein Papier auf dem Weichgrund als Zeichnungsmedium, klebt dasselbe am Grund fest. Beim Abziehen des Papiers wird die darunterliegende Kupferplatte freigelegt. Sie kann danach im Säurebad geätzt werden.