Greeks
preferred label: Griechen @de

Siphnians
type: Concept
in scheme: scheme
preferred label: Siphnier @de
broader: Greeks
change note:
  comment: initial version
  created: 2021-04-23T08:22:43+00:00
  creator: Elena Chestnova
definition: The people of Siphnos. See Siphnian Treasury of Delphi.
change note:
  creator: Elena Chestnova
  modified: 2022-06-17T10:12:47+00:00
notation: PEOPLE0098