Radieren
preferred label: etching @en

Weichgrundradierer
preferred label: Soft-ground etcher @en

in Weichgrund radieren
type: Concept
in scheme: scheme
preferred label: etching in soft-ground @en
alternative label: im Durchdruckverfahren radieren
alternative label: graver en vernis mou @fr
alternative label: incidere in vernice molle @it
broader: Radieren
related: Weichgrundradierer
change note:
  comment: initial version @en
  created: 2022-02-09T10:31:24+00:00
  creator: Michael Matile
scope note: Bezeichnet die Tätigkeit des Radierens in Weichgrund.
change note:
  creator: Michael Matile
  modified: 2022-02-09T10:41:15+00:00