Artists by activity, medium or work type
preferred label: Künstler nach Tätigkeit, Medium oder Werkart @de

coloring
preferred label: kolorieren @de

Colorist
type: Concept
in scheme: scheme
preferred label: Kolorist @de
alternative label: col.
alternative label: colouring by brush
alternative label: Coloriste @fr
alternative label: Colorista @it
broader: Artists by activity, medium or work type
related: coloring
change note:
  creator: Michael Matile
  modified: 2022-01-24T14:05:10+00:00
change note:
  creator: Michael Matile
  modified: 2021-10-19T06:50:35+00:00
change note:
  creator: Sophie Guermann
  modified: 2021-09-13T14:09:44+00:00
change note:
  comment: initial version
  created: 2021-05-19T09:28:19+00:00
  creator: Sophie Guermann
change note:
  creator: Sophie Guermann
  modified: 2021-09-14T11:45:04+00:00
change note:
  creator: Michael Matile
  modified: 2021-10-19T06:54:35+00:00
change note:
  creator: Michael Matile
  modified: 2021-10-31T11:23:38+00:00
scope note: Bezeichnet die Person, die das gestochene/gedruckte Werk koloriert hat. @de
change note:
  creator: Florian Kräutli
  modified: 2022-02-21T15:05:15+00:00
related match: E11 Modification