Levantine
type: Concept
in scheme: scheme
preferred label: Levantin @de
broader: Materials by form
change note:
  comment: initial version
  created: 2021-05-26T11:28:10+00:00
  creator: Elena Chestnova
definition: Four-shaft weft face twill cloth used for linings, originally made from silk.
change note:
  creator: Elena Chestnova
  modified: 2022-05-18T19:18:25+00:00
notation: THING0340