Engraver
preferred label: Stecher @de

Printmaker
preferred label: Druckgrafiker @de

Copper engraver
type: Concept
in scheme: scheme
preferred label: Kupferstecher @de
alternative label: engraved and finished @en
alternative label: engraved by @en
alternative label: engraved in copper @en
alternative label: Graveur sur cuivre @fr
alternative label: gravés en taille douce @fr
alternative label: graveur en taille douce @fr
alternative label: Incisore di rame @it
alternative label: cae.
alternative label: cael.
alternative label: caelab.
alternative label: caelata
alternative label: caelati
alternative label: caelator
alternative label: caelav.
alternative label: caelavit
broader: Engraver
related: Printmaker
change note:
  creator: Sophie Guermann
  modified: 2021-05-25T06:30:15+00:00
change note:
  creator: Sophie Guermann
  modified: 2021-05-19T06:19:47+00:00
change note:
  comment: initial version @en
  created: 2021-05-18T15:05:22+00:00
  creator: Sophie Guermann
change note:
  creator: Sophie Guermann
  modified: 2021-05-19T06:12:24+00:00
change note:
  creator: Michael Matile
  modified: 2022-01-24T14:10:38+00:00
scope note: Bezeichnet den Stecher im Herstellungsprozess eines Kupferstichs. @de